Compiling ipu-codegen v0.1.0 (/srv/home/gc-sdk/ipu-stack/crates/ipu-codegen) Finished `test` profile [unoptimized + debuginfo] target(s) in 6.39s Running unittests src/lib.rs (target/debug/deps/ipu_codegen-6043466c50aa8f05) running 1 test test exchange::tests::snapshot_rejects_inactive_paired_sender_lane ... FAILED failures: ---- exchange::tests::snapshot_rejects_inactive_paired_sender_lane stdout ---- thread 'exchange::tests::snapshot_rejects_inactive_paired_sender_lane' (498870) panicked at crates/ipu-codegen/src/exchange/tests.rs:1141:13: assertion failed: matches!(snapshot.validate(), Err(ExchangeLoweringError::InvalidSnapshot(_))) note: run with `RUST_BACKTRACE=1` environment variable to display a backtrace failures: exchange::tests::snapshot_rejects_inactive_paired_sender_lane test result: FAILED. 0 passed; 1 failed; 0 ignored; 0 measured; 262 filtered out; finished in 0.00s error: test failed, to rerun pass `-p ipu-codegen --lib`