Compiling ipu-codegen v0.1.0 (/srv/home/gc-sdk/ipu-stack/crates/ipu-codegen) Finished `test` profile [unoptimized + debuginfo] target(s) in 6.90s Running unittests src/lib.rs (target/debug/deps/ipu_codegen-6043466c50aa8f05) running 1 test test package::profile::tests::active_tiles_with_empty_repeat_bodies_have_complete_samples ... FAILED failures: ---- package::profile::tests::active_tiles_with_empty_repeat_bodies_have_complete_samples stdout ---- thread 'package::profile::tests::active_tiles_with_empty_repeat_bodies_have_complete_samples' (510141) panicked at crates/ipu-codegen/src/package/profile.rs:597:17: an empty repeat still executes on the tile note: run with `RUST_BACKTRACE=1` environment variable to display a backtrace failures: package::profile::tests::active_tiles_with_empty_repeat_bodies_have_complete_samples test result: FAILED. 0 passed; 1 failed; 0 ignored; 0 measured; 268 filtered out; finished in 0.01s error: test failed, to rerun pass `-p ipu-codegen --lib`