Compiling ipu-codegen v0.1.0 (/srv/home/gc-sdk/ipu-stack/crates/ipu-codegen) Finished `test` profile [unoptimized + debuginfo] target(s) in 4.63s Running unittests src/lib.rs (target/debug/deps/ipu_codegen-6043466c50aa8f05) running 1 test thread 'estimate::cycles::tests::memoized_rearrangements_preserve_critical_path_costs' (511185) panicked at crates/ipu-codegen/src/estimate/cycles.rs:417:25: assertion `left == right` failed left: RearrangementCost { cycles: 149504, exchange_cycles: 0 } right: RearrangementCost { cycles: 2336, exchange_cycles: 0 } note: run with `RUST_BACKTRACE=1` environment variable to display a backtrace test estimate::cycles::tests::memoized_rearrangements_preserve_critical_path_costs ... FAILED failures: failures: estimate::cycles::tests::memoized_rearrangements_preserve_critical_path_costs test result: FAILED. 0 passed; 1 failed; 0 ignored; 0 measured; 270 filtered out; finished in 0.00s error: test failed, to rerun pass `-p ipu-codegen --lib`