Compiling ipu-codegen v0.1.0 (/srv/home/gc-sdk/ipu-stack/crates/ipu-codegen) Finished `test` profile [unoptimized + debuginfo] target(s) in 5.93s Running unittests src/lib.rs (target/debug/deps/ipu_codegen-6043466c50aa8f05) running 1 test thread 'estimate::tests::memory_retains_repeat_yields_until_the_backedge' (508880) panicked at crates/ipu-codegen/src/estimate/tests.rs:439:9: assertion `left == right` failed: repeat count 1 left: 2048 right: 2560 note: run with `RUST_BACKTRACE=1` environment variable to display a backtrace test estimate::tests::memory_retains_repeat_yields_until_the_backedge ... FAILED failures: failures: estimate::tests::memory_retains_repeat_yields_until_the_backedge test result: FAILED. 0 passed; 1 failed; 0 ignored; 0 measured; 267 filtered out; finished in 0.00s error: test failed, to rerun pass `-p ipu-codegen --lib`