Compiling ipu-codegen v0.1.0 (/srv/home/gc-sdk/ipu-stack/crates/ipu-codegen) Finished `test` profile [unoptimized + debuginfo] target(s) in 7.41s Running unittests src/lib.rs (target/debug/deps/ipu_codegen-6043466c50aa8f05) running 1 test thread 'low::expand::primitive_fragments::primitive_casts_pair_corresponding_linear_fragments' (522644) panicked at crates/ipu-codegen/src/low/expand/tests/primitive_fragments.rs:58:17: assertion `left == right` failed: shape [8, 16], tiles 1 left: [ShardExtent { axis: 0, start: 0, logical_end: 1, physical_end: 1 }, ShardExtent { axis: 1, start: 0, logical_end: 16, physical_end: 16 }] right: [ShardExtent { axis: 0, start: 1, logical_end: 2, physical_end: 2 }, ShardExtent { axis: 1, start: 0, logical_end: 16, physical_end: 16 }] note: run with `RUST_BACKTRACE=1` environment variable to display a backtrace test low::expand::primitive_fragments::primitive_casts_pair_corresponding_linear_fragments ... FAILED failures: failures: low::expand::primitive_fragments::primitive_casts_pair_corresponding_linear_fragments test result: FAILED. 0 passed; 1 failed; 0 ignored; 0 measured; 281 filtered out; finished in 0.00s error: test failed, to rerun pass `-p ipu-codegen --lib`