Finished `test` profile [unoptimized + debuginfo] target(s) in 0.05s Running unittests src/lib.rs (target/debug/deps/ipu_codegen-6043466c50aa8f05) running 1 test thread 'tile::iterated_aliases::sum_aliases_follow_iterated_parameters_in_local_copies_and_exchanges' (552786) panicked at crates/ipu-codegen/src/tile/tests/iterated_aliases.rs:137:9: assertion `left == right` failed: the locally owned partial must change each iteration left: 0 right: 1 note: run with `RUST_BACKTRACE=1` environment variable to display a backtrace test tile::iterated_aliases::sum_aliases_follow_iterated_parameters_in_local_copies_and_exchanges ... FAILED failures: failures: tile::iterated_aliases::sum_aliases_follow_iterated_parameters_in_local_copies_and_exchanges test result: FAILED. 0 passed; 1 failed; 0 ignored; 0 measured; 288 filtered out; finished in 0.01s error: test failed, to rerun pass `-p ipu-codegen --lib`