Compiling ipu-package v0.1.0 (/srv/home/gc-sdk/ipu-stack/crates/ipu-package) Compiling ipu-exchange v0.1.0 (/srv/home/gc-sdk/ipu-stack/crates/ipu-exchange) Compiling ipu-elf v0.1.0 (/srv/home/gc-sdk/ipu-stack/crates/ipu-elf) Compiling ipu-driver v0.1.0 (/srv/home/gc-sdk/ipu-stack/crates/ipu-driver) Compiling ipu-codegen v0.1.0 (/srv/home/gc-sdk/ipu-stack/crates/ipu-codegen) Finished `release` profile [optimized] target(s) in 37.55s Running unittests src/lib.rs (target/release/deps/ipu_codegen-25da5871cc05cbf1) running 1 test original_body_calls=2 emitted_calls=1 reported_cycles=1402 live_work_cycles=1390 thread 'low::initialization::tests::audit_padding_cost_tracks_live_work' (751242) panicked at crates/ipu-codegen/src/low/initialization.rs:280:9: assertion `left == right` failed: final cost must describe the work retained for emission left: 1402 right: 1390 note: run with `RUST_BACKTRACE=1` environment variable to display a backtrace test low::initialization::tests::audit_padding_cost_tracks_live_work ... FAILED failures: failures: low::initialization::tests::audit_padding_cost_tracks_live_work test result: FAILED. 0 passed; 1 failed; 0 ignored; 0 measured; 308 filtered out; finished in 0.00s error: test failed, to rerun pass `-p ipu-codegen --lib`